{"text_format":"1","workbook":"xlsx","n_sheets":3,"sheets":["MODELE-1","MODELE-2","LISTE"],"not_rendered":{"charts":0,"images":4,"macros":1,"external_links":0,"defined_names":4,"comments":1,"pivot_tables":0},"unopened":[],"bounds":{"document_bytes":16777216,"sheet_cells":100000,"rows_first":2000,"rows_last":500,"rows_between":2000,"halvings":0,"cell_chars":16384,"cell_head_chars":4096},"cells_cut":0,"cells_raw":0,"read":"whole","date_system":"1900"}

{"sheet":"MODELE-1","index":0,"n_rows":68,"n_cols":30,"rows_kept":68,"cut":false,"hidden":false,"merged":[[18,13,19,14],[18,15,19,15],[18,16,19,16],[18,17,19,17],[32,0,32,6],[67,0,67,6],[67,19,67,25],[32,19,32,25],[0,13,0,17],[1,13,1,17],[2,13,2,17],[3,13,3,17],[4,13,4,17],[20,12,21,12],[20,13,21,14],[59,12,60,12],[59,13,60,14],[59,15,60,15],[59,16,60,16],[59,17,60,17],[43,12,44,12],[43,13,44,17],[45,13,46,17],[47,13,48,17],[49,13,50,17],[53,13,54,14],[53,15,54,15],[53,16,54,16],[53,17,54,17],[24,17,25,17],[20,17,21,17],[22,12,23,12],[30,19,31,19],[30,25,31,25],[30,26,31,26],[30,27,31,27],[30,28,31,28],[30,29,31,29],[30,0,31,0],[30,6,31,6],[30,7,31,7],[30,8,31,8],[30,9,31,9],[30,10,31,10],[65,0,66,0],[59,19,60,19],[59,25,60,25],[57,19,58,19],[57,25,58,25],[55,19,56,19],[55,25,56,25],[49,25,50,25],[47,19,48,19],[47,25,48,25],[47,0,48,0],[47,6,48,6],[47,7,48,7],[47,8,48,8],[47,9,48,9],[63,14,63,15],[55,12,56,12],[55,13,56,14],[55,15,56,15],[55,16,56,16],[55,17,56,17],[57,12,58,12],[57,13,58,14],[57,15,58,15],[65,26,66,26],[65,27,66,27],[65,28,66,28],[65,29,66,29],[63,27,64,27],[63,28,64,28],[63,29,64,29],[65,6,66,6],[65,7,66,7],[65,8,66,8],[65,9,66,9],[65,10,66,10],[65,19,66,19],[65,25,66,25],[61,29,62,29],[63,0,64,0],[63,6,64,6],[63,7,64,7],[63,8,64,8],[63,9,64,9],[63,10,64,10],[63,19,64,19],[63,25,64,25],[63,26,64,26],[61,19,62,19],[61,25,62,25],[61,26,62,26],[61,27,62,27],[61,28,62,28],[61,0,62,0],[61,6,62,6],[61,7,62,7],[61,8,62,8],[61,9,62,9],[61,10,62,10],[59,26,60,26],[59,27,60,27],[59,28,60,28],[59,29,60,29],[59,0,60,0],[59,6,60,6],[59,7,60,7],[59,8,60,8],[59,9,60,9],[59,10,60,10],[57,26,58,26],[57,27,58,27],[57,28,58,28],[57,29,58,29],[57,0,58,0],[57,6,58,6],[57,7,58,7],[57,8,58,8],[57,9,58,9],[57,10,58,10],[57,16,58,16],[57,17,58,17],[55,26,56,26],[55,27,56,27],[55,28,56,28],[55,29,56,29],[53,26,54,26],[53,27,54,27],[53,28,54,28],[53,29,54,29],[55,0,56,0],[55,6,56,6],[55,7,56,7],[55,8,56,8],[55,9,56,9],[55,10,56,10],[53,0,54,0],[53,6,54,6],[53,7,54,7],[53,8,54,8],[53,9,54,9],[53,10,54,10],[53,19,54,19],[53,25,54,25],[51,10,52,10],[51,19,52,19],[51,25,52,25],[49,26,50,26],[49,27,50,27],[49,28,50,28],[49,29,50,29],[51,0,52,0],[51,6,52,6],[51,7,52,7],[51,8,52,8],[51,9,52,9],[49,12,50,12],[49,19,50,19],[49,0,50,0],[49,6,50,6],[49,7,50,7],[49,8,50,8],[49,9,50,9],[49,10,50,10],[51,29,52,29],[51,26,52,26],[51,27,52,27],[51,28,52,28],[47,26,48,26],[47,27,48,27],[47,28,48,28],[47,29,48,29],[47,10,48,10],[47,12,48,12],[45,25,46,25],[45,26,46,26],[45,27,46,27],[45,28,46,28],[45,29,46,29],[45,12,46,12],[45,19,46,19],[43,26,44,26],[43,27,44,27],[43,28,44,28],[43,29,44,29],[45,0,46,0],[45,6,46,6],[45,7,46,7],[45,8,46,8],[45,9,46,9],[45,10,46,10],[43,19,44,19],[43,25,44,25],[43,0,44,0],[43,6,44,6],[43,7,44,7],[43,8,44,8],[43,9,44,9],[43,10,44,10],[42,1,42,5],[42,18,42,19],[42,20,42,24],[40,19,40,21],[40,22,40,29],[35,0,35,10],[35,13,35,17],[36,0,36,10],[36,13,36,17],[37,0,37,10],[37,13,37,17],[38,0,38,10],[38,13,38,17],[39,13,39,17],[40,3,40,10],[40,0,40,2],[28,26,29,26],[28,27,29,27],[28,28,29,28],[28,29,29,29],[26,26,27,26],[26,27,27,27],[26,28,27,28],[26,29,27,29],[28,0,29,0],[28,6,29,6],[28,7,29,7],[28,8,29,8],[28,9,29,9],[28,10,29,10],[28,14,28,15],[28,19,29,19],[28,25,29,25],[24,0,25,0],[24,6,25,6],[24,7,25,7],[24,8,25,8],[24,9,25,9],[24,29,25,29],[26,0,27,0],[26,6,27,6],[26,7,27,7],[26,8,27,8],[26,9,27,9],[26,10,27,10],[26,19,27,19],[26,25,27,25],[24,10,25,10],[24,19,25,19],[24,25,25,25],[24,26,25,26],[24,27,25,27],[24,28,25,28],[24,12,25,12],[24,13,25,14],[24,15,25,15],[24,16,25,16],[20,28,21,28],[20,29,21,29],[22,0,23,0],[22,6,23,6],[22,7,23,7],[22,8,23,8],[22,9,23,9],[22,10,23,10],[22,19,23,19],[22,25,23,25],[22,26,23,26],[22,27,23,27],[22,28,23,28],[22,29,23,29],[22,13,23,14],[22,15,23,15],[22,16,23,16],[22,17,23,17],[18,29,19,29],[20,0,21,0],[20,6,21,6],[20,7,21,7],[20,8,21,8],[20,9,21,9],[20,10,21,10],[20,19,21,19],[20,25,21,25],[20,26,21,26],[18,19,19,19],[18,25,19,25],[18,26,19,26],[18,27,19,27],[18,28,19,28],[20,15,21,15],[20,16,21,16],[18,0,19,0],[18,6,19,6],[18,7,19,7],[18,8,19,8],[18,9,19,9],[18,10,19,10],[20,27,21,27],[16,19,17,19],[16,25,17,25],[16,26,17,26],[16,27,17,27],[16,28,17,28],[16,29,17,29],[16,0,17,0],[16,6,17,6],[16,7,17,7],[16,8,17,8],[16,9,17,9],[16,10,17,10],[14,25,15,25],[14,26,15,26],[14,27,15,27],[14,28,15,28],[14,29,15,29],[14,10,15,10],[12,25,13,25],[12,26,13,26],[12,27,13,27],[12,28,13,28],[12,29,13,29],[12,12,13,12],[12,13,13,17],[14,12,15,12],[14,13,15,17],[14,0,15,0],[14,6,15,6],[14,7,15,7],[14,8,15,8],[14,9,15,9],[12,19,13,19],[12,0,13,0],[12,6,13,6],[12,7,13,7],[12,8,13,8],[12,9,13,9],[12,10,13,10],[14,19,15,19],[10,25,11,25],[10,26,11,26],[10,27,11,27],[10,28,11,28],[10,29,11,29],[10,10,11,10],[8,25,9,25],[8,26,9,26],[8,27,9,27],[8,28,9,28],[8,29,9,29],[8,12,9,12],[10,12,11,12],[10,13,11,17],[8,13,9,17],[7,20,7,24],[8,0,9,0],[8,6,9,6],[8,7,9,7],[8,8,9,8],[8,9,9,9],[5,0,5,2],[0,0,0,10],[10,0,11,0],[10,6,11,6],[10,7,11,7],[10,8,11,8],[10,9,11,9],[8,10,9,10],[8,19,9,19],[7,1,7,5],[7,18,7,19],[10,19,11,19],[3,0,3,10],[2,0,2,10],[1,0,1,10],[5,19,5,21],[5,22,5,29],[5,3,5,10]]}
["Concours",null,null,null,null,null,null,null,null,null,null,null,"Nom :"]
["Tir 3D",null,null,null,null,null,null,null,null,null,null,null,"Prénom:"]
[null,null,null,null,null,null,null,null,null,null,null,null,"Commune :"]
["1er janvier 2000",null,null,null,null,null,null,null,null,null,null,null,"Club :"]
[null,null,null,null,null,null,null,null,null,null,null,null,"N° Licence :"]
["Prénom :",null,null,{"$f":"IF(N2=0,\" \",N2)","v":" "},null,null,null,null,null,null,null,null,null,null,null,null,null,null,null,"Prénom :",null,null,{"$f":"IF(N2=0,\" \",N2)","v":" "}]
[]
[null,"Flèches",null,null,null,null,"Volée","Total",11,10,8,null,null,null,null,null,null,null,null,null,"Flèches",null,null,null,null,"Volée","Total",11,10,8]
[1,11,10,8,5,0,null,null,null,null,null,null,"Peloton :",null,null,null,null,null,null,13,11,10,8,5,0]
[null,11,10,8,5,0,null,null,null,null,null,null,null,null,null,null,null,null,null,null,11,10,8,5,0]
[{"$f":"A9+1","v":2},11,10,8,5,0,null,null,null,null,null,null,"Arc :",null,null,null,null,null,null,{"$f":"T9+1","v":14},11,10,8,5,0]
[null,11,10,8,5,0,null,null,null,null,null,null,null,null,null,null,null,null,null,null,11,10,8,5,0]
[{"$f":"A11+1","v":3},11,10,8,5,0,null,null,null,null,null,null,"Cat. âge :",null,null,null,null,null,null,{"$f":"T11+1","v":15},11,10,8,5,0]
[null,11,10,8,5,0,null,null,null,null,null,null,null,null,null,null,null,null,null,null,11,10,8,5,0]
[{"$f":"A13+1","v":4},11,10,8,5,0,null,null,null,null,null,null,"Genre :",null,null,null,null,null,null,{"$f":"T13+1","v":16},11,10,8,5,0]
[null,11,10,8,5,0,null,null,null,null,null,null,null,null,null,null,null,null,null,null,11,10,8,5,0]
[{"$f":"A15+1","v":5},11,10,8,5,0,null,null,null,null,null,null,null,null,null,null,null,null,null,{"$f":"T15+1","v":17},11,10,8,5,0]
[null,11,10,8,5,0,null,null,null,null,null,null,null,null,null,null,null,null,null,null,11,10,8,5,0]
[{"$f":"A17+1","v":6},11,10,8,5,0,null,null,null,null,null,null,null,"Score",null,11,10,8,null,{"$f":"T17+1","v":18},11,10,8,5,0]
[null,11,10,8,5,0,null,null,null,null,null,null,null,null,null,null,null,null,null,null,11,10,8,5,0]
[{"$f":"A19+1","v":7},11,10,8,5,0,null,null,null,null,null,null,"Serie 1",null,null,null,null,null,null,{"$f":"T19+1","v":19},11,10,8,5,0]
[null,11,10,8,5,0,null,null,null,null,null,null,null,null,null,null,null,null,null,null,11,10,8,5,0]
[{"$f":"A21+1","v":8},11,10,8,5,0,null,null,null,null,null,null,"Série 2",null,null,null,null,null,null,{"$f":"T21+1","v":20},11,10,8,5,0]
[null,11,10,8,5,0,null,null,null,null,null,null,null,null,null,null,null,null,null,null,11,10,8,5,0]
[{"$f":"A23+1","v":9},11,10,8,5,0,null,null,null,null,null,null,"Total :",null,null,null,null,null,null,{"$f":"T23+1","v":21},11,10,8,5,0]
[null,11,10,8,5,0,null,null,null,null,null,null,null,null,null,null,null,null,null,null,11,10,8,5,0]
[{"$f":"A25+1","v":10},11,10,8,5,0,null,null,null,null,null,null,null,null,null,null,null,null,null,{"$f":"T25+1","v":22},11,10,8,5,0]
[null,11,10,8,5,0,null,null,null,null,null,null,null,null,null,null,null,null,null,null,11,10,8,5,0]
[{"$f":"A27+1","v":11},11,10,8,5,0,null,null,null,null,null,null,"Archer :",null,"Marqueur :",null,null,null,null,{"$f":"T27+1","v":23},11,10,8,5,0]
[null,11,10,8,5,0,null,null,null,null,null,null,null,null,null,null,null,null,null,null,11,10,8,5,0]
[{"$f":"A29+1","v":12},11,10,8,5,0,null,null,null,null,null,null,null,null,null,null,null,null,null,{"$f":"T29+1","v":24},11,10,8,5,0]
[null,11,10,8,5,0,null,null,null,null,null,null,null,null,null,null,null,null,null,null,11,10,8,5,0]
["Total 12 cibles",null,null,null,null,null,null,null,null,null,null,null,null,null,null,null,null,null,null,"Total 12 cibles"]
[]
[]
["Concours",null,null,null,null,null,null,null,null,null,null,null,"Nom :",{"$f":"IF(N1=0,\" \",N1)","v":" "}]
["Tir 3D",null,null,null,null,null,null,null,null,null,null,null,"Prénom:",{"$f":"IF(N2=0,\" \",N2)","v":" "}]
[null,null,null,null,null,null,null,null,null,null,null,null,"Commune :",{"$f":"IF(N3=0,\" \",N3)","v":" "}]
["1er janvier 2000",null,null,null,null,null,null,null,null,null,null,null,"Club :",{"$f":"IF(N4=0,\" \",N4)","v":" "}]
[null,null,null,null,null,null,null,null,null,null,null,null,"N° Licence :",{"$f":"IF(N5=0,\" \",N5)","v":" "}]
["Prénom :",null,null,{"$f":"IF(N2=0,\" \",N2)","v":" "},null,null,null,null,null,null,null,null,null,null,null,null,null,null,null,"Prénom :",null,null,{"$f":"IF(N2=0,\" \",N2)","v":" "}]
[]
[null,"Flèches",null,null,null,null,"Volée","Total",11,10,8,null,null,null,null,null,null,null,null,null,"Flèches",null,null,null,null,"Volée","Total",11,10,8]
[1,11,10,8,5,0,null,null,null,null,null,null,"Peloton :",{"$f":"IF(N9=0,\" \",N9)","v":" "},null,null,null,null,null,13,11,10,8,5,0]
[null,11,10,8,5,0,null,null,null,null,null,null,null,null,null,null,null,null,null,null,11,10,8,5,0]
[{"$f":"A44+1","v":2},11,10,8,5,0,null,null,null,null,null,null,"Arc :",{"$f":"IF(N11=0,\" \",N11)","v":" "},null,null,null,null,null,{"$f":"T44+1","v":14},11,10,8,5,0]
[null,11,10,8,5,0,null,null,null,null,null,null,null,null,null,null,null,null,null,null,11,10,8,5,0]
[{"$f":"A46+1","v":3},11,10,8,5,0,null,null,null,null,null,null,"Cat. âge :",{"$f":"IF(N13=0,\" \",N13)","v":" "},null,null,null,null,null,{"$f":"T46+1","v":15},11,10,8,5,0]
[null,11,10,8,5,0,null,null,null,null,null,null,null,null,null,null,null,null,null,null,11,10,8,5,0]
[{"$f":"A48+1","v":4},11,10,8,5,0,null,null,null,null,null,null,"Genre :",{"$f":"IF(N15=0,\" \",N15)","v":" "},null,null,null,null,null,{"$f":"T48+1","v":16},11,10,8,5,0]
[null,11,10,8,5,0,null,null,null,null,null,null,null,null,null,null,null,null,null,null,11,10,8,5,0]
[{"$f":"A50+1","v":5},11,10,8,5,0,null,null,null,null,null,null,null,null,null,null,null,null,null,{"$f":"T50+1","v":17},11,10,8,5,0]
[null,11,10,8,5,0,null,null,null,null,null,null,null,null,null,null,null,null,null,null,11,10,8,5,0]
[{"$f":"A52+1","v":6},11,10,8,5,0,null,null,null,null,null,null,null,"Score",null,11,10,8,null,{"$f":"T52+1","v":18},11,10,8,5,0]
[null,11,10,8,5,0,null,null,null,null,null,null,null,null,null,null,null,null,null,null,11,10,8,5,0]
[{"$f":"A54+1","v":7},11,10,8,5,0,null,null,null,null,null,null,"Serie 1",null,null,null,null,null,null,{"$f":"T54+1","v":19},11,10,8,5,0]
[null,11,10,8,5,0,null,null,null,null,null,null,null,null,null,null,null,null,null,null,11,10,8,5,0]
[{"$f":"A56+1","v":8},11,10,8,5,0,null,null,null,null,null,null,"Série 2",null,null,null,null,null,null,{"$f":"T56+1","v":20},11,10,8,5,0]
[null,11,10,8,5,0,null,null,null,null,null,null,null,null,null,null,null,null,null,null,11,10,8,5,0]
[{"$f":"A58+1","v":9},11,10,8,5,0,null,null,null,null,null,null,"Total :",null,null,null,null,null,null,{"$f":"T58+1","v":21},11,10,8,5,0]
[null,11,10,8,5,0,null,null,null,null,null,null,null,null,null,null,null,null,null,null,11,10,8,5,0]
[{"$f":"A60+1","v":10},11,10,8,5,0,null,null,null,null,null,null,null,null,null,null,null,null,null,{"$f":"T60+1","v":22},11,10,8,5,0]
[null,11,10,8,5,0,null,null,null,null,null,null,null,null,null,null,null,null,null,null,11,10,8,5,0]
[{"$f":"A62+1","v":11},11,10,8,5,0,null,null,null,null,null,null,"Archer :",null,"Marqueur :",null,null,null,null,{"$f":"T62+1","v":23},11,10,8,5,0]
[null,11,10,8,5,0,null,null,null,null,null,null,null,null,null,null,null,null,null,null,11,10,8,5,0]
[{"$f":"A64+1","v":12},11,10,8,5,0,null,null,null,null,null,null,null,null,null,null,null,null,null,{"$f":"T64+1","v":24},11,10,8,5,0]
[null,11,10,8,5,0,null,null,null,null,null,null,null,null,null,null,null,null,null,null,11,10,8,5,0]
["Total 12 cibles",null,null,null,null,null,null,null,null,null,null,null,null,null,null,null,null,null,null,"Total 12 cibles"]

{"sheet":"MODELE-2","index":1,"n_rows":58,"n_cols":30,"rows_kept":58,"cut":false,"hidden":false,"merged":[[57,0,57,6],[32,19,32,24],[57,19,57,25],[15,13,15,14],[46,17,47,17],[48,12,49,12],[48,13,49,14],[48,15,49,15],[48,16,49,16],[48,17,49,17],[20,15,21,15],[20,16,21,16],[20,17,21,17],[55,27,56,27],[55,28,56,28],[55,29,56,29],[30,12,30,17],[32,12,33,17],[34,12,34,17],[35,12,36,17],[38,13,38,17],[53,29,54,29],[53,14,53,15],[53,19,54,19],[53,25,54,25],[53,26,54,26],[53,27,54,27],[53,28,54,28],[51,27,52,27],[51,28,52,28],[51,29,52,29],[49,19,50,19],[49,25,50,25],[49,26,50,26],[49,27,50,27],[55,0,56,0],[55,6,56,6],[55,7,56,7],[55,8,56,8],[55,9,56,9],[55,10,56,10],[55,19,56,19],[55,25,56,25],[55,26,56,26],[53,0,54,0],[53,6,54,6],[53,7,54,7],[53,8,54,8],[53,9,54,9],[53,10,54,10],[51,19,52,19],[51,25,52,25],[51,26,52,26],[51,0,52,0],[51,6,52,6],[51,7,52,7],[51,8,52,8],[51,9,52,9],[51,10,52,10],[50,12,51,12],[50,13,51,14],[50,15,51,15],[50,16,51,16],[50,17,51,17],[49,28,50,28],[49,29,50,29],[49,10,50,10],[47,25,48,25],[47,26,48,26],[47,27,48,27],[47,28,48,28],[47,29,48,29],[49,0,50,0],[49,6,50,6],[49,7,50,7],[49,8,50,8],[49,9,50,9],[47,19,48,19],[46,12,47,12],[46,13,47,14],[46,15,47,15],[46,16,47,16],[47,0,48,0],[47,6,48,6],[47,7,48,7],[47,8,48,8],[47,9,48,9],[47,10,48,10],[45,25,46,25],[45,26,46,26],[45,27,46,27],[45,28,46,28],[45,29,46,29],[45,10,46,10],[43,25,44,25],[43,26,44,26],[43,27,44,27],[43,28,44,28],[43,29,44,29],[45,0,46,0],[45,6,46,6],[45,7,46,7],[45,8,46,8],[45,9,46,9],[43,10,44,10],[43,19,44,19],[44,13,45,14],[44,15,45,15],[44,16,45,16],[44,17,45,17],[45,19,46,19],[41,26,42,26],[41,27,42,27],[41,28,42,28],[41,29,42,29],[43,0,44,0],[43,6,44,6],[43,7,44,7],[43,8,44,8],[43,9,44,9],[42,16,42,17],[42,13,42,14],[39,0,40,0],[39,6,40,6],[39,7,40,7],[39,8,40,8],[39,9,40,9],[39,27,40,27],[39,28,40,28],[39,29,40,29],[41,0,42,0],[41,6,42,6],[41,7,42,7],[41,8,42,8],[41,9,42,9],[41,10,42,10],[41,19,42,19],[39,10,40,10],[39,19,40,19],[39,25,40,25],[39,26,40,26],[39,13,39,17],[40,13,40,17],[41,13,41,14],[41,15,41,16],[41,25,42,25],[35,29,36,29],[37,0,38,0],[37,6,38,6],[37,7,38,7],[37,8,38,8],[37,9,38,9],[37,10,38,10],[37,19,38,19],[35,19,36,19],[35,25,36,25],[35,26,36,26],[35,27,36,27],[35,28,36,28],[37,25,38,25],[37,26,38,26],[37,27,38,27],[37,28,38,28],[37,29,38,29],[35,0,36,0],[35,6,36,6],[35,7,36,7],[35,8,36,8],[35,9,36,9],[35,10,36,10],[33,10,34,10],[33,19,34,19],[33,25,34,25],[30,19,30,21],[30,22,30,29],[33,0,34,0],[33,6,34,6],[33,7,34,7],[33,8,34,8],[33,9,34,9],[30,0,30,2],[30,3,30,10],[33,27,34,27],[33,28,34,28],[33,29,34,29],[33,26,34,26],[32,0,32,5],[25,19,26,19],[25,25,26,25],[25,26,26,26],[25,27,26,27],[25,28,26,28],[25,29,26,29],[23,26,24,26],[23,27,24,27],[23,28,24,28],[23,29,24,29],[27,19,27,25],[27,0,27,6],[25,0,26,0],[25,6,26,6],[25,7,26,7],[25,8,26,8],[25,9,26,9],[25,10,26,10],[21,29,22,29],[23,0,24,0],[23,6,24,6],[23,7,24,7],[23,8,24,8],[23,9,24,9],[23,10,24,10],[23,14,23,15],[23,19,24,19],[23,25,24,25],[21,10,22,10],[21,19,22,19],[21,25,22,25],[21,26,22,26],[21,27,22,27],[21,28,22,28],[20,12,21,12],[20,13,21,14],[21,0,22,0],[21,6,22,6],[21,7,22,7],[21,8,22,8],[21,9,22,9],[19,19,20,19],[19,25,20,25],[19,26,20,26],[19,27,20,27],[17,27,18,27],[17,28,18,28],[17,29,18,29],[16,15,17,15],[16,16,17,16],[16,17,17,17],[17,0,18,0],[17,6,18,6],[17,7,18,7],[19,0,20,0],[19,6,20,6],[19,7,20,7],[19,8,20,8],[19,9,20,9],[19,10,20,10],[17,19,18,19],[17,25,18,25],[17,26,18,26],[15,29,16,29],[15,0,16,0],[15,6,16,6],[15,7,16,7],[15,8,16,8],[15,9,16,9],[15,10,16,10],[16,12,17,12],[16,13,17,14],[17,8,18,8],[17,9,18,9],[17,10,18,10],[18,12,19,12],[15,19,16,19],[15,25,16,25],[15,26,16,26],[15,27,16,27],[15,28,16,28],[19,28,20,28],[19,29,20,29],[18,13,19,14],[18,15,19,15],[18,16,19,16],[18,17,19,17],[13,19,14,19],[13,25,14,25],[13,26,14,26],[13,27,14,27],[13,28,14,28],[13,29,14,29],[13,0,14,0],[13,6,14,6],[13,7,14,7],[13,8,14,8],[13,9,14,9],[13,10,14,10],[11,27,12,27],[11,28,12,28],[11,29,12,29],[9,29,10,29],[10,13,10,17],[11,0,12,0],[11,6,12,6],[11,7,12,7],[11,8,12,8],[11,9,12,9],[11,10,12,10],[11,13,11,14],[11,15,11,16],[9,13,9,17],[9,19,10,19],[9,25,10,25],[9,26,10,26],[9,27,10,27],[9,28,10,28],[12,13,12,14],[12,16,12,17],[9,0,10,0],[9,6,10,6],[9,7,10,7],[9,8,10,8],[9,9,10,9],[9,10,10,10],[11,19,12,19],[11,25,12,25],[11,26,12,26],[5,29,6,29],[7,0,8,0],[7,6,8,6],[7,7,8,7],[7,8,8,8],[7,9,8,9],[7,10,8,10],[7,19,8,19],[7,25,8,25],[7,26,8,26],[5,12,6,17],[5,19,6,19],[5,25,6,25],[5,26,6,26],[5,27,6,27],[5,28,6,28],[7,27,8,27],[7,28,8,28],[7,29,8,29],[8,13,8,17],[5,0,6,0],[5,6,6,6],[5,7,6,7],[5,8,6,8],[5,9,6,9],[5,10,6,10],[3,0,4,0],[3,6,4,6],[3,7,4,7],[3,8,4,8],[3,9,4,9],[3,10,4,10],[0,12,0,17],[0,19,0,21],[0,22,0,29],[2,12,3,17],[3,19,4,19],[3,25,4,25],[3,26,4,26],[0,0,0,2],[0,3,0,10],[3,27,4,27],[3,28,4,28],[3,29,4,29],[4,12,4,17],[2,19,2,24],[2,0,2,5]]}
["Prénom :",null,null,{"$f":"IF(N10=0,\" \",N10)","v":" "},null,null,null,null,null,null,null,null,"Concours",null,null,null,null,null,null,"Prénom :",null,null,{"$f":"IF(N10=0,\" \",N10)","v":" "}]
[]
["Flèches",null,null,null,null,null,"Volée","Total",11,10,8,null,"Tir 3D",null,null,null,null,null,null,"Flèches",null,null,null,null,null,"Volée","Total",11,10,8]
[1,11,10,8,5,0,null,null,null,null,null,null,null,null,null,null,null,null,null,13,11,10,8,5,0]
[null,11,10,8,5,0,null,null,null,null,null,null,null,null,null,null,null,null,null,null,11,10,8,5,0]
[{"$f":"A4+1","v":2},11,10,8,5,0,null,null,null,null,null,null,"1er Janvier 2000",null,null,null,null,null,null,{"$f":"T4+1","v":14},11,10,8,5,0]
[null,11,10,8,5,0,null,null,null,null,null,null,null,null,null,null,null,null,null,null,11,10,8,5,0]
[{"$f":"A6+1","v":3},11,10,8,5,0,null,null,null,null,null,null,null,null,null,null,null,null,null,{"$f":"T6+1","v":15},11,10,8,5,0]
[null,11,10,8,5,0,null,null,null,null,null,null,"Nom :",null,null,null,null,null,null,null,11,10,8,5,0]
[{"$f":"A8+1","v":4},11,10,8,5,0,null,null,null,null,null,null,"Prénom:",null,null,null,null,null,null,{"$f":"T8+1","v":16},11,10,8,5,0]
[null,11,10,8,5,0,null,null,null,null,null,null,"Club :",null,null,null,null,null,null,null,11,10,8,5,0]
[{"$f":"A10+1","v":5},11,10,8,5,0,null,null,null,null,null,null,"N° Licence :",null,null,"Peloton :",null,null,null,{"$f":"T10+1","v":17},11,10,8,5,0]
[null,11,10,8,5,0,null,null,null,null,null,null,"Categorie",null,null,"Arc :",null,null,null,null,11,10,8,5,0]
[{"$f":"A12+1","v":6},11,10,8,5,0,null,null,null,null,null,null,null,null,null,null,null,null,null,{"$f":"T12+1","v":18},11,10,8,5,0]
[null,11,10,8,5,0,null,null,null,null,null,null,null,null,null,null,null,null,null,null,11,10,8,5,0]
[{"$f":"A14+1","v":7},11,10,8,5,0,null,null,null,null,null,null,null,"Score",null,11,10,8,null,{"$f":"T14+1","v":19},11,10,8,5,0]
[null,11,10,8,5,0,null,null,null,null,null,null,"Serie 1",null,null,null,null,null,null,null,11,10,8,5,0]
[{"$f":"A16+1","v":8},11,10,8,5,0,null,null,null,null,null,null,null,null,null,null,null,null,null,{"$f":"T16+1","v":20},11,10,8,5,0]
[null,11,10,8,5,0,null,null,null,null,null,null,"Série 2",null,null,null,null,null,null,null,11,10,8,5,0]
[{"$f":"A18+1","v":9},11,10,8,5,0,null,null,null,null,null,null,null,null,null,null,null,null,null,{"$f":"T18+1","v":21},11,10,8,5,0]
[null,11,10,8,5,0,null,null,null,null,null,null,"Total :",null,null,null,null,null,null,null,11,10,8,5,0]
[{"$f":"A20+1","v":10},11,10,8,5,0,null,null,null,null,null,null,null,null,null,null,null,null,null,{"$f":"T20+1","v":22},11,10,8,5,0]
[null,11,10,8,5,0,null,null,null,null,null,null,null,null,null,null,null,null,null,null,11,10,8,5,0]
[{"$f":"A22+1","v":11},11,10,8,5,0,null,null,null,null,null,null,"Archer :",null,"Marqueur :",null,null,null,null,{"$f":"T22+1","v":23},11,10,8,5,0]
[null,11,10,8,5,0,null,null,null,null,null,null,null,null,null,null,null,null,null,null,11,10,8,5,0]
[{"$f":"A24+1","v":12},11,10,8,5,0,null,null,null,null,null,null,null,null,null,null,null,null,null,{"$f":"T24+1","v":24},11,10,8,5,0]
[null,11,10,8,5,0,null,null,null,null,null,null,null,null,null,null,null,null,null,null,11,10,8,5,0]
["Total 12 cibles",null,null,null,null,null,null,null,null,null,null,null,null,null,null,null,null,null,null,"Total 12 cibles"]
[]
[]
["Prénom :",null,null,{"$f":"IF(N10=0,\" \",N10)","v":" "},null,null,null,null,null,null,null,null,"Concours",null,null,null,null,null,null,"Prénom :",null,null,{"$f":"IF(N10=0,\" \",N10)","v":" "}]
[]
["Flèches",null,null,null,null,null,"Volée","Total",11,10,8,null,"Tir 3D",null,null,null,null,null,null,"Flèches",null,null,null,null,null,"Volée","Total",11,10,8]
[1,11,10,8,5,0,null,null,null,null,null,null,null,null,null,null,null,null,null,13,11,10,8,5,0]
[null,11,10,8,5,0,null,null,null,null,null,null,null,null,null,null,null,null,null,null,11,10,8,5,0]
[{"$f":"A34+1","v":2},11,10,8,5,0,null,null,null,null,null,null,"1er Janvier 2000",null,null,null,null,null,null,{"$f":"T34+1","v":14},11,10,8,5,0]
[null,11,10,8,5,0,null,null,null,null,null,null,null,null,null,null,null,null,null,null,11,10,8,5,0]
[{"$f":"A36+1","v":3},11,10,8,5,0,null,null,null,null,null,null,null,null,null,null,null,null,null,{"$f":"T36+1","v":15},11,10,8,5,0]
[null,11,10,8,5,0,null,null,null,null,null,null,"Nom :",{"$f":"IF(N9=0,\" \",N9)","v":" "},null,null,null,null,null,null,11,10,8,5,0]
[{"$f":"A38+1","v":4},11,10,8,5,0,null,null,null,null,null,null,"Prénom:",{"$f":"IF(N10=0,\" \",N10)","v":" "},null,null,null,null,null,{"$f":"T38+1","v":16},11,10,8,5,0]
[null,11,10,8,5,0,null,null,null,null,null,null,"Club :",{"$f":"IF(N11=0,\" \",N11)","v":" "},null,null,null,null,null,null,11,10,8,5,0]
[{"$f":"A40+1","v":5},11,10,8,5,0,null,null,null,null,null,null,"N° Licence :",{"$f":"IF(N12=0,\" \",N12)","v":" "},null,"Peloton :",null,{"$f":"IF(R12=0,\" \",R12)","v":" "},null,{"$f":"T40+1","v":17},11,10,8,5,0]
[null,11,10,8,5,0,null,null,null,null,null,null,"Categorie :",{"$f":"IF(N13=0,\" \",N13)","v":" "},null,"Arc :",{"$f":"IF(Q13=0,\" \",Q13)","v":" "},null,null,null,11,10,8,5,0]
[{"$f":"A42+1","v":6},11,10,8,5,0,null,null,null,null,null,null,null,null,null,null,null,null,null,{"$f":"T42+1","v":18},11,10,8,5,0]
[null,11,10,8,5,0,null,null,null,null,null,null,null,"Score",null,11,10,8,null,null,11,10,8,5,0]
[{"$f":"A44+1","v":7},11,10,8,5,0,null,null,null,null,null,null,null,null,null,null,null,null,null,{"$f":"T44+1","v":19},11,10,8,5,0]
[null,11,10,8,5,0,null,null,null,null,null,null,"Serie 1",null,null,null,null,null,null,null,11,10,8,5,0]
[{"$f":"A46+1","v":8},11,10,8,5,0,null,null,null,null,null,null,null,null,null,null,null,null,null,{"$f":"T46+1","v":20},11,10,8,5,0]
[null,11,10,8,5,0,null,null,null,null,null,null,"Série 2",null,null,null,null,null,null,null,11,10,8,5,0]
[{"$f":"A48+1","v":9},11,10,8,5,0,null,null,null,null,null,null,null,null,null,null,null,null,null,{"$f":"T48+1","v":21},11,10,8,5,0]
[null,11,10,8,5,0,null,null,null,null,null,null,"Total :",null,null,null,null,null,null,null,11,10,8,5,0]
[{"$f":"A50+1","v":10},11,10,8,5,0,null,null,null,null,null,null,null,null,null,null,null,null,null,{"$f":"T50+1","v":22},11,10,8,5,0]
[null,11,10,8,5,0,null,null,null,null,null,null,null,null,null,null,null,null,null,null,11,10,8,5,0]
[{"$f":"A52+1","v":11},11,10,8,5,0,null,null,null,null,null,null,"Archer :",null,"Marqueur :",null,null,null,null,{"$f":"T52+1","v":23},11,10,8,5,0]
[null,11,10,8,5,0,null,null,null,null,null,null,null,null,null,null,null,null,null,null,11,10,8,5,0]
[{"$f":"A54+1","v":12},11,10,8,5,0,null,null,null,null,null,null,null,null,null,null,null,null,null,{"$f":"T54+1","v":24},11,10,8,5,0]
[null,11,10,8,5,0,null,null,null,null,null,null,null,null,null,null,null,null,null,null,11,10,8,5,0]
["Total 12 cibles",null,null,null,null,null,null,null,null,null,null,null,null,null,null,null,null,null,null,"Total 12 cibles"]

{"sheet":"LISTE","index":2,"n_rows":96,"n_cols":14,"rows_kept":96,"cut":false,"hidden":false,"merged":[]}
["Horodateur","Nom (Majuscule) :","Prénom (Minuscule) :","Commune du club / Compagnie","Nom du Club / Compagnie","Numéro de Licence","Catégorie","Type d'arc","e-mail","Demandes particulières","Catégorie d'age","Genre","PELOTON","Paiement"]
[null,"GOUY","Aline","Massy","Archers de Massy","123456D","Senior Femme","Classique / Recurve",null,null,{"$f":"IF($G2=\"Benjamin Femme\",\"Benjamin\",IF($G2=\"Benjamin Homme\",\"Benjamin\",IF($G2=\"Minime Femme\",\"Minime\",IF($G2=\"Minime homme\",\"Minime\",IF($G2=\"Cadet Femme\",\"Cadet\",IF($G2=\"Cadet Homme\",\"Cadet\",IF($G2=\"Junior Femme\",\"Junior\",IF($G2=\"Junior Homme\",\"Junior\",IF($G2=\"Senior Femme\",\"Senior\",IF($G2=\"Senior Homme\",\"Senior\",IF($G2=\"Vétéran Femme\",\"Vétéran\",IF($G2=\"Vétéran Homme\",\"Vétéran\",IF($G2=\"Super Vétéran Femme\",\"Super Vétéran\",\"Super Vétéran\")))))))))))))","v":"Senior"},{"$f":"IF($G2=\"Benjamin Femme\",\"Femme\",IF($G2=\"Benjamin Homme\",\"Homme\",IF($G2=\"Minime Femme\",\"Femme\",IF($G2=\"Minime homme\",\"Homme\",IF($G2=\"Cadet Femme\",\"Femme\",IF($G2=\"Cadet Homme\",\"Homme\",IF($G2=\"Junior Femme\",\"Femme\",IF($G2=\"Junior Homme\",\"Homme\",IF($G2=\"Senior Femme\",\"Femme\",IF($G2=\"Senior Homme\",\"Homme\",IF($G2=\"Vétéran Femme\",\"Femme\",IF($G2=\"Vétéran Homme\",\"Homme\",IF($G2=\"Super Vétéran Femme\",\"Femme\",\"Homme\")))))))))))))","v":"Femme"},"1A"]
[null,"SERVEILLE","Didier","Massy","Archers de Massy","654321A","Senior Homme","Classique / Recurve",null,null,"Senior","Homme","1B"]
[null,"TARRISSE","Aurore","Eybens","Archers du château d'Eybens","987654A","Senior Femme","Poulie / Copound",null,null,"Senior","Femme","1C"]
[null,"WEINGAERTNER","Mathieu","Eybens","Archers du château d'Eybens","456789M","Senior Homme","Classique / Recurve",null,null,"Senior","Homme","1D"]
[null,"JOBERT","Alexandra","Carquefou","Archers de l'erdre","264802A","Senior Femme","Classique / Recurve",null,null,"Senior","Femme"]
[null,null,null,null,null,null,null,null,null,null,"Super Vétéran","Homme"]
[null,null,null,null,null,null,null,null,null,null,"Super Vétéran","Homme"]
[null,null,null,null,null,null,null,null,null,null,"Super Vétéran","Homme"]
[null,null,null,null,null,null,null,null,null,null,"Super Vétéran","Homme"]
[null,null,null,null,null,null,null,null,null,null,"Super Vétéran","Homme"]
[null,null,null,null,null,null,null,null,null,null,"Super Vétéran","Homme"]
[null,null,null,null,null,null,null,null,null,null,"Super Vétéran","Homme"]
[null,null,null,null,null,null,null,null,null,null,"Super Vétéran","Homme"]
[null,null,null,null,null,null,null,null,null,null,"Super Vétéran","Homme"]
[null,null,null,null,null,null,null,null,null,null,"Super Vétéran","Homme"]
[null,null,null,null,null,null,null,null,null,null,"Super Vétéran","Homme"]
[null,null,null,null,null,null,null,null,null,null,"Super Vétéran","Homme"]
[null,null,null,null,null,null,null,null,null,null,"Super Vétéran","Homme"]
[null,null,null,null,null,null,null,null,null,null,"Super Vétéran","Homme"]
[null,null,null,null,null,null,null,null,null,null,"Super Vétéran","Homme"]
[null,null,null,null,null,null,null,null,null,null,"Super Vétéran","Homme"]
[null,null,null,null,null,null,null,null,null,null,"Super Vétéran","Homme"]
[null,null,null,null,null,null,null,null,null,null,"Super Vétéran","Homme"]
[null,null,null,null,null,null,null,null,null,null,"Super Vétéran","Homme"]
[null,null,null,null,null,null,null,null,null,null,"Super Vétéran","Homme"]
[null,null,null,null,null,null,null,null,null,null,"Super Vétéran","Homme"]
[null,null,null,null,null,null,null,null,null,null,"Super Vétéran","Homme"]
[null,null,null,null,null,null,null,null,null,null,"Super Vétéran","Homme"]
[null,null,null,null,null,null,null,null,null,null,"Super Vétéran","Homme"]
[null,null,null,null,null,null,null,null,null,null,"Super Vétéran","Homme"]
[null,null,null,null,null,null,null,null,null,null,"Super Vétéran","Homme"]
[null,null,null,null,null,null,null,null,null,null,"Super Vétéran","Homme"]
[null,null,null,null,null,null,null,null,null,null,{"$f":"IF($G34=\"Benjamin Femme\",\"Benjamin\",IF($G34=\"Benjamin Homme\",\"Benjamin\",IF($G34=\"Minime Femme\",\"Minime\",IF($G34=\"Minime homme\",\"Minime\",IF($G34=\"Cadet Femme\",\"Cadet\",IF($G34=\"Cadet Homme\",\"Cadet\",IF($G34=\"Junior Femme\",\"Junior\",IF($G34=\"Junior Homme\",\"Junior\",IF($G34=\"Senior Femme\",\"Senior\",IF($G34=\"Senior Homme\",\"Senior\",IF($G34=\"Vétéran Femme\",\"Vétéran\",IF($G34=\"Vétéran Homme\",\"Vétéran\",IF($G34=\"Super Vétéran Femme\",\"Super Vétéran\",\"Super Vétéran\")))))))))))))","v":"Super Vétéran"},{"$f":"IF($G34=\"Benjamin Femme\",\"Femme\",IF($G34=\"Benjamin Homme\",\"Homme\",IF($G34=\"Minime Femme\",\"Femme\",IF($G34=\"Minime homme\",\"Homme\",IF($G34=\"Cadet Femme\",\"Femme\",IF($G34=\"Cadet Homme\",\"Homme\",IF($G34=\"Junior Femme\",\"Femme\",IF($G34=\"Junior Homme\",\"Homme\",IF($G34=\"Senior Femme\",\"Femme\",IF($G34=\"Senior Homme\",\"Homme\",IF($G34=\"Vétéran Femme\",\"Femme\",IF($G34=\"Vétéran Homme\",\"Homme\",IF($G34=\"Super Vétéran Femme\",\"Femme\",\"Homme\")))))))))))))","v":"Homme"}]
[null,null,null,null,null,null,null,null,null,null,"Super Vétéran","Homme"]
[null,null,null,null,null,null,null,null,null,null,"Super Vétéran","Homme"]
[null,null,null,null,null,null,null,null,null,null,"Super Vétéran","Homme"]
[null,null,null,null,null,null,null,null,null,null,"Super Vétéran","Homme"]
[null,null,null,null,null,null,null,null,null,null,"Super Vétéran","Homme"]
[null,null,null,null,null,null,null,null,null,null,"Super Vétéran","Homme"]
[null,null,null,null,null,null,null,null,null,null,"Super Vétéran","Homme"]
[null,null,null,null,null,null,null,null,null,null,"Super Vétéran","Homme"]
[null,null,null,null,null,null,null,null,null,null,"Super Vétéran","Homme"]
[null,null,null,null,null,null,null,null,null,null,"Super Vétéran","Homme"]
[null,null,null,null,null,null,null,null,null,null,"Super Vétéran","Homme"]
[null,null,null,null,null,null,null,null,null,null,"Super Vétéran","Homme"]
[null,null,null,null,null,null,null,null,null,null,"Super Vétéran","Homme"]
[null,null,null,null,null,null,null,null,null,null,"Super Vétéran","Homme"]
[null,null,null,null,null,null,null,null,null,null,"Super Vétéran","Homme"]
[null,null,null,null,null,null,null,null,null,null,"Super Vétéran","Homme"]
[null,null,null,null,null,null,null,null,null,null,"Super Vétéran","Homme"]
[null,null,null,null,null,null,null,null,null,null,"Super Vétéran","Homme"]
[null,null,null,null,null,null,null,null,null,null,"Super Vétéran","Homme"]
[null,null,null,null,null,null,null,null,null,null,"Super Vétéran","Homme"]
[null,null,null,null,null,null,null,null,null,null,"Super Vétéran","Homme"]
[null,null,null,null,null,null,null,null,null,null,"Super Vétéran","Homme"]
[null,null,null,null,null,null,null,null,null,null,"Super Vétéran","Homme"]
[null,null,null,null,null,null,null,null,null,null,"Super Vétéran","Homme"]
[null,null,null,null,null,null,null,null,null,null,"Super Vétéran","Homme"]
[null,null,null,null,null,null,null,null,null,null,"Super Vétéran","Homme"]
[null,null,null,null,null,null,null,null,null,null,"Super Vétéran","Homme"]
[null,null,null,null,null,null,null,null,null,null,"Super Vétéran","Homme"]
[null,null,null,null,null,null,null,null,null,null,"Super Vétéran","Homme"]
[null,null,null,null,null,null,null,null,null,null,"Super Vétéran","Homme"]
[null,null,null,null,null,null,null,null,null,null,"Super Vétéran","Homme"]
[null,null,null,null,null,null,null,null,null,null,{"$f":"IF($G66=\"Benjamin Femme\",\"Benjamin\",IF($G66=\"Benjamin Homme\",\"Benjamin\",IF($G66=\"Minime Femme\",\"Minime\",IF($G66=\"Minime homme\",\"Minime\",IF($G66=\"Cadet Femme\",\"Cadet\",IF($G66=\"Cadet Homme\",\"Cadet\",IF($G66=\"Junior Femme\",\"Junior\",IF($G66=\"Junior Homme\",\"Junior\",IF($G66=\"Senior Femme\",\"Senior\",IF($G66=\"Senior Homme\",\"Senior\",IF($G66=\"Vétéran Femme\",\"Vétéran\",IF($G66=\"Vétéran Homme\",\"Vétéran\",IF($G66=\"Super Vétéran Femme\",\"Super Vétéran\",\"Super Vétéran\")))))))))))))","v":"Super Vétéran"},{"$f":"IF($G66=\"Benjamin Femme\",\"Femme\",IF($G66=\"Benjamin Homme\",\"Homme\",IF($G66=\"Minime Femme\",\"Femme\",IF($G66=\"Minime homme\",\"Homme\",IF($G66=\"Cadet Femme\",\"Femme\",IF($G66=\"Cadet Homme\",\"Homme\",IF($G66=\"Junior Femme\",\"Femme\",IF($G66=\"Junior Homme\",\"Homme\",IF($G66=\"Senior Femme\",\"Femme\",IF($G66=\"Senior Homme\",\"Homme\",IF($G66=\"Vétéran Femme\",\"Femme\",IF($G66=\"Vétéran Homme\",\"Homme\",IF($G66=\"Super Vétéran Femme\",\"Femme\",\"Homme\")))))))))))))","v":"Homme"}]
[null,null,null,null,null,null,null,null,null,null,"Super Vétéran","Homme"]
[null,null,null,null,null,null,null,null,null,null,"Super Vétéran","Homme"]
[null,null,null,null,null,null,null,null,null,null,"Super Vétéran","Homme"]
[null,null,null,null,null,null,null,null,null,null,"Super Vétéran","Homme"]
[null,null,null,null,null,null,null,null,null,null,"Super Vétéran","Homme"]
[null,null,null,null,null,null,null,null,null,null,"Super Vétéran","Homme"]
[null,null,null,null,null,null,null,null,null,null,"Super Vétéran","Homme"]
[null,null,null,null,null,null,null,null,null,null,"Super Vétéran","Homme"]
[null,null,null,null,null,null,null,null,null,null,"Super Vétéran","Homme"]
[null,null,null,null,null,null,null,null,null,null,"Super Vétéran","Homme"]
[null,null,null,null,null,null,null,null,null,null,"Super Vétéran","Homme"]
[null,null,null,null,null,null,null,null,null,null,"Super Vétéran","Homme"]
[null,null,null,null,null,null,null,null,null,null,"Super Vétéran","Homme"]
[null,null,null,null,null,null,null,null,null,null,"Super Vétéran","Homme"]
[null,null,null,null,null,null,null,null,null,null,"Super Vétéran","Homme"]
[null,null,null,null,null,null,null,null,null,null,"Super Vétéran","Homme"]
[null,null,null,null,null,null,null,null,null,null,"Super Vétéran","Homme"]
[null,null,null,null,null,null,null,null,null,null,"Super Vétéran","Homme"]
[null,null,null,null,null,null,null,null,null,null,"Super Vétéran","Homme"]
[null,null,null,null,null,null,null,null,null,null,"Super Vétéran","Homme"]
[null,null,null,null,null,null,null,null,null,null,"Super Vétéran","Homme"]
[null,null,null,null,null,null,null,null,null,null,"Super Vétéran","Homme"]
[null,null,null,null,null,null,null,null,null,null,"Super Vétéran","Homme"]
[null,null,null,null,null,null,null,null,null,null,"Super Vétéran","Homme"]
[null,null,null,null,null,null,null,null,null,null,"Super Vétéran","Homme"]
[null,null,null,null,null,null,null,null,null,null,"Super Vétéran","Homme"]
[null,null,null,null,null,null,null,null,null,null,"Super Vétéran","Homme"]
[null,null,null,null,null,null,null,null,null,null,"Super Vétéran","Homme"]
[null,null,null,null,null,null,null,null,null,null,"Super Vétéran","Homme"]
[null,null,null,null,null,null,null,null,null,null,"Super Vétéran","Homme"]